{"text_format":"1","workbook":"xlsx","n_sheets":3,"sheets":["Bestellformular","Tabelle1","Emmi"],"not_rendered":{"charts":0,"images":1,"macros":1,"external_links":0,"defined_names":2,"comments":0,"pivot_tables":0},"unopened":[],"bounds":{"document_bytes":16777216,"sheet_cells":100000,"rows_first":2000,"rows_last":500,"rows_between":2000,"halvings":0,"cell_chars":16384,"cell_head_chars":4096},"cells_cut":0,"cells_raw":0,"read":"whole","date_system":"1900"}

{"sheet":"Bestellformular","index":0,"n_rows":60,"n_cols":7,"rows_kept":60,"cut":false,"hidden":false,"merged":[[0,5,0,6],[0,1,0,2],[1,1,1,2],[36,1,37,1],[36,0,37,0],[36,2,37,2],[25,0,26,0],[25,1,26,1],[25,2,26,2],[36,3,37,3],[42,4,42,5],[43,4,43,5],[44,4,44,5],[45,4,45,5],[46,4,46,5],[47,4,47,5],[54,4,54,5],[55,4,55,5],[56,4,56,5],[48,4,48,5],[49,4,49,5],[50,4,50,5],[51,4,51,5],[52,4,52,5],[53,4,53,5],[57,4,57,5],[58,4,58,5],[59,4,59,5],[42,6,42,7],[59,6,59,7],[58,6,58,7],[43,6,43,7],[44,6,44,7],[45,6,45,7],[46,6,46,7],[47,6,47,7],[48,6,48,7],[49,6,49,7],[50,6,50,7],[51,6,51,7],[52,6,52,7],[53,6,53,7],[54,6,54,7],[55,6,55,7],[56,6,56,7],[57,6,57,7]]}
["Besteller:",null,null,null,"Ort"]
["Lieferdatum:",null,null,{"$f":"NOT(OR(COUNTBLANK(B1)+COUNTBLANK(F1)+COUNTBLANK(B2)))","v":false},"Bitte betreffendes auswählen (rote Schrift)!"]
["TK Kartoffel",null,"Einheit",null,"Milchprodukte",null,"Einheit"]
["Pommes Frites","grob/fein","4x2.5kg",null,"Jogurt ","Nature","3kg/500gr"]
["Superfrites ","Knuspermantel","4x2.5kg",null,"Jogurt ","gemischt","90gr/180gr"]
["Ofenfrites",null,"2x2.5kg",null,"Jogurt ","Erdb./Himb. /Ban.","10 x 180gr"]
["Country Cuts ","gewürzt/nature","2x2.5kg",null,"Quark","Mager","1kg"]
["Croquetten ","paniert/nature","2x2.5kg",null,"Vollmilch","Past","12x1ltr/10lt"]
["Rösti ","Galetten/Croquetten","2x2.5kg",null,"Vollmilch","UHT","12x1lt"]
["Fresh Rösti ",null,"2x2.5kg",null,"Vollrahm","UHT 35%","12x1lt/500gr"]
["TK Gemüse",null,"Einheit",null,"Halbrahm","UHT 25%","12x1lt/250gr"]
["Bohnen ","extra-, mittel-, fein","2x2.5kg",null,"Kaffeerahm",null,"Fl / Port."]
["Broccoli",null,"2x2.5kg",null,"Sauerhalbrahm",0.15,"500gr"]
["Erbsen fein",null,"2x2.5kg",null,"Butter","Vorzugsbutter","Würf./Bech."]
["Gartenerbse",null,"2x2.5kg",null,"Butter","Kochbutter","250gr/1kg"]
["Kefen",null,"2x2.5kg",null,"Eier","Bodenhaltung","40Stk/Krt"]
["Romanesco",null,"2x2.5kg",null,"Eier","Freilandhaltung","60Stk/Krt"]
["Rosenkohl",null,"2x2.5kg",null,"Eifix","Vollei/Eigelb","10 x 1ltr "]
["Gemüsemisch.","Brunoise/Julienne","4x1.25kg",null,"Käse",null,"Einheit"]
["Sommergemüse",null,"2x2.5kg",null,"Appenzeller",{"$f":"IF(G20=\"1/4 Lb\", \"classic (ca. 1.6kg)\", IF(G20=\"1/2 Lb\", \"classic (ca. 3.2kg)\", \"classic (Lb ≈ 6.5kg)\"))","v":"classic (Lb ≈ 6.5kg)"},"1/4,1/2,1Lb"]
["TK Früchte",null,"Einheit",null,"Tilsiter","rot/grün",{"$f":"IF(F21=\"rot\", \"Lb = 4kg\", IF(F21=\"grün\", \"Lb = 4.5kg\", \"Laib\"))","v":"Laib"}]
["Aprikosen ","halbiert","2x2.5kg",null,"Rahmtilsiter","Thurgau","Laib"]
["Brombeeren",null,"2x2.5kg",null,"Raclette eckig","1/4 Laib","ca. 1.5kg"]
["Himbeeren",null,"2x2.5kg",null,"Emmentaler","mild","ca. 2kg"]
["Zwetschgen","halbiert","2x2.5kg",null,"Gruyere","mild","ca. 2kg"]
["Birchermüesli Fruchtmischung",null,"2x2.5kg",null,"Mozzarella","Bufala","125gr"]
[null,null,null,null,"Mozzarella","Santa Lucia","1kg"]
["Waldbeermisch.",null,"2x2.5kg",null,"Feta","Greco"]
["Marroni ganz",null,"2x2.5kg",null,"Cantadou","Kräuter","125g/1.25kg"]
["TK Pilze",null,"Einheit",null,"Hüttenkäse","Nature","450gr"]
["Champignons","geschnitten","5x1kg",null,"Glacé"]
["Mischpilze","Standart","5x1kg",null,"Typ:…","Sorte: …",{"$f":"IF(E32=\"Typ:…\",\" \",VLOOKUP(Bestellformular!F32,Emmi!A22:D40,4,FALSE))","v":" "}]
["Gebrauchsfertige Produkte",null,"Einheit",null,"Typ:…","Sorte: …",{"$f":"IF(E33=\"Typ:…\",\" \",VLOOKUP(Bestellformular!F33,Emmi!F21:I40,4,FALSE))","v":" "}]
["Mischsalat","Basic/Cali./Mais.",{"$f":"IF(B34=\"Basic\",\"200gr\",\"250gr\")","v":"250gr"},null,"Typ:…","Sorte: …",{"$f":"IF(E34=\"Typ:…\",\" \",VLOOKUP(Bestellformular!F34,Emmi!J21:M40,4,FALSE))","v":" "}]
["Mischsalat","Royal/Mais.","1kg",null,"Typ:…","Sorte: …",{"$f":"IF(E35=\"Typ:…\",\" \",VLOOKUP(Bestellformular!F35,Emmi!O21:R40,4,FALSE))","v":" "}]
["Kopfsalat","Handschnitt/Beutel",null,null,"Typ:…","Sorte: …",{"$f":"IF(E36=\"Typ:…\",\" \",VLOOKUP(Bestellformular!F36,Emmi!S21:V40,4,FALSE))","v":" "}]
["Karotten","ganz/ Julienne/ Scheiben/ Stengel",null,null,"Typ:…","Sorte: …",{"$f":"IF(E37=\"Typ:…\",\" \",VLOOKUP(Bestellformular!F37,Emmi!X21:AA40,4,FALSE))","v":" "}]
[null,null,null,null,"Typ:…","Sorte: …",{"$f":"IF(E38=\"Typ:…\",\" \",VLOOKUP(Bestellformular!F38,Emmi!AB21:AE40,4,FALSE))","v":" "}]
["Karotten","Pfälzer",null,null,"Typ:…","Sorte: …",{"$f":"IF(E39=\"Typ:…\",\" \",VLOOKUP(Bestellformular!F39,Emmi!AG21:AJ40,4,FALSE))","v":" "}]
["Zucchetti","Rissolée/Scheiben",null,null,"Typ:…","Sorte: …",{"$f":"IF(E40=\"Typ:…\",\" \",VLOOKUP(Bestellformular!F40,Emmi!AK21:AN40,4,FALSE))","v":" "}]
["Kartoffeln gesch.","Agria/ Charlotte",null,null,"Typ:…","Sorte: …",{"$f":"IF(E41=\"Typ:…\",\" \",VLOOKUP(Bestellformular!F41,Emmi!AP21:AS40,4,FALSE))","v":" "}]
["Kartoffeln ged.","Scheiben",null,null,"Ergänzungen"]
["Rösti lose ","geraffelt gekocht"]
["Rösti Kart. ganz","gedämpft"]
["Peperoni bunt","Würfel - grob"]
["Knoblauch","geschält/Brunoise"]
["Zwiebeln","ganz/Brunoise"]
["Peterli","fein gehack","100gr/Sch"]
["Ratatouille","grob"]
["Apfel ","geschält"]
["Fruchtsalat "," Kessel","5kg"]
["Backwaren"]
["Schinkengipfel","tgl. normal/mini",{"$f":"IF(B53=\"tgl. normal\",\"50x90gr\",IF(B53=\"tgl. mini\",\"50x32gr\",\" \"))","v":" "}]
["Chäschüechli","vorgeb. normal/mini",{"$f":"IF(B54=\"vorgeb. normal\",\"24x80gr\",IF(B54=\"vorgeb. mini\",\"96x16gr\",\" \"))","v":" "}]
["Buttergipfel","vorgegärt","100x45gr"]
["Gipfel","Schoko - Minor","75x95gr"]
["Laugenbretzel","jumbo","24x150gr"]
["Laugenbretzel","enggeschlungen","30x90gr"]
["Pariserbrötli",null,"50x95gr"]
["Toastbrot","geschnitten","12x500gr"]

{"sheet":"Tabelle1","index":1,"n_rows":15,"n_cols":11,"rows_kept":15,"cut":false,"hidden":true,"merged":[]}
["Pommes","Country Cuts","Croquette","Rösti","Bohnen","gemüse","Handschnitt/Beutel","ganz/ Julienne/ Scheiben/ Stengel","Agria/ Charlotte","geschält/Brunoise","ganz/Brunoise"]
["grob/fein","gewürzt/nature","paniert/nature","Galetten/Croquetten","extra-, mittel-, fein","Brunoise/Julienne","Handschnitt","ganz geschält","Agria","geschält","ganz geschält"]
["grob","gewürzt","paniert","Galetten","Extrafein","Brunoise","150gr Bt.","Julienne","Charlotte","Brunoise fein","Brunoise"]
["fein","nature","nature","Croquetten","Mittelfein","Julienne",null,"Scheiben"]
[null,null,null,null,null,null,null,"Stengel"]
["3kg/500gr","90gr/180gr","Erdb./Himb. /Ban.","12x1ltr/10lt","12x1lt/500gr","12x1lt/250gr","Fl / Port.","Würf./Bech.","250gr/1kg","Vollei/Eigelb","1/4,1/2,1Lb"]
["3kg Kessel","10 x 90gr","Erdbeere","12 x 1ltr","12 x 1 ltr","12 x 1 ltr","Flasche 500ml","Würfel 10gr","250gr","Vollei","1/4 Lb"]
["500gr","10 x 180gr","Himbeere","10 ltr Beutel","500gr","250gr","Port. 200 x 12gr","Becher 10gr","1kg","Eigelb","1/2 Lb"]
[null,null,"Banane",null,null,null,null,null,null,null,"1/1 Lb"]
[]
[]
["rot/grün","125g/1.25kg","Basic/Cali./Mais.","Royal/Mais.","Rissolée/Scheiben","ganz/Brunoise","tgl. normal/mini","vorgeb. normal/mini"]
["rot","125gr","Basic","Royal","Risolée","ganz","tgl. normal","vorgeb. normal"]
["grün","1.25kg","California","Maison","Scheiben","Brunoise","tgl. mini","vorgeb. mini"]
[null,null,"Maison"]

{"sheet":"Emmi","index":2,"n_rows":40,"n_cols":45,"rows_kept":40,"cut":false,"hidden":true,"merged":[]}
["Glace Typen","Favorito",null,"Creazione",null,"Edizione",null,"Sorbetto",null,"Kids Ice",null,"Ice Kiss",null,"Ice Cake",null,"Lutscher",null,"Wasserglacé",null,"Cornet",null,"Dessert"]
["Typ:…","Sorte: …","Packung","Sorte: …","Packung","Sorte: …","Packung","Sorte: …","Packung","Sorte: …","Packung","Sorte: …","Packung","Sorte: …","Packung","Sorte: …","Packung","Sorte: …","Packung","Sorte: …","Packung","Sorte: …","Packung"]
["Favorito","Vanille","4000ml","Vanille","4000ml","Rosen - Himbeer","2000ml","Zitrone","4000ml","Bauernhoftassen","MP: 3x4","Parfait Mokka","16 x 100ml","Macciato","1272ml","Chocolat","18x70ml","Rotor","32x77ml","Vanille","12x145ml","Panna Cotta","1050ml"]
["Creazione","Erdbeer","4000ml","Erdbeer","4000ml","Zitrone Basilikum","2000ml","Zwetschge","4000ml","Globolino ","24x160ml","Caramello","16 x 100ml","Nougatine","1297ml","Scream Classic","20x120ml","Rocket Cola-Lemon","18x50ml","Erdbeer","12x145ml","Flan Caramel","24x100ml"]
["Edizione","Schokolade","4000ml","Schokolade","4000ml","Popcorn","2000ml","Aprikose","4000ml","Piet","20x120ml","Panna Cotta - Himbeer","16 x 100ml","Romanoff","1272ml","Scream Almond","20x120ml","Rocket Orange-Lemon","18x50ml","Choco Latte","12x145ml","Mousse au Chocolat","1500ml"]
["Sorbetto","Crème Fraiche","4000ml","Caffè Croccante","4000ml","Marroni","2000ml","Birne","4000ml","Thesi","16x120ml","Soufflé Grand Marnier","16 x 100ml","Schwarzwälder","1000ml","Creamy Stracciatella","30x80ml","Sioux","20x62ml",null,null,"Tiramisu","1000ml"]
["Kids Ice","Ice Coffee","4000ml","Caramello","4000ml","Choco Brownies","2000ml","Cassis","4000ml","Globi","20x120ml",null,null,"Cappuccino","1000ml","Caramello - CdL","20x100ml","Freeze Lemon","24x115ml"]
["Ice Kiss","Stracciatella","4000ml","Walnuss","4000ml","Erdbeer","2000ml","Blutorange","4000ml","Gloki","16x80ml",null,null,"Erdbeer","1000ml","Fragola - CdL","20x100ml"]
["Ice Cake","Zimt","4000ml","Pistache","4000ml","Mango Passions.","2000ml","Apfel","4000ml","Globi Zoo","24x100ml",null,null,"Crème Brulée","1000ml","Macchiato - CdL","20x100ml"]
["Lutscher","Haselnuss","4000ml","Tiramisu","4000ml","Schokolade - Chili","2000ml","Himbeer","4000ml",null,null,null,null,"Cassata Gastronomie","1000ml","Jogurt Ice Himbeer","20x100ml"]
["Wasserglacé",null,null,"Jamaica","4000ml","Minze Choco Splits","2000ml","Ananas","4000ml",null,null,null,null,null,null,"Jogurt Ice Mango","20x100ml"]
["Cornet",null,null,"Banane","4000ml","Sorbetto Melone","2000ml",null,null,null,null,null,null,null,null,"Flipino Lemon","20x70ml"]
["Dessert",null,null,"Eiercognac","4000ml",null,null,null,null,null,null,null,null,null,null,"Flipino Himbeer","20x70ml"]
[null,null,null,"Kokosnuss","4000ml"]
[null,null,null,"Shalin Jogurt Mango","4000ml"]
[null,null,null,"Shalin Jogurt Himbeer","4000ml"]
[]
[]
[]
["LOAD 1",null,null,null,null,"LOAD 2",null,null,null,"LOAD 3",null,null,null,null,"LOAD 4",null,null,null,"LOAD 5",null,null,null,null,"LOAD 6",null,null,null,"LOAD 7",null,null,null,null,"LOAD 8",null,null,null,"LOAD 9",null,null,null,null,"LOAD 10"]
[{"$f":"Bestellformular!E32","v":"Typ:…"},{"$f":"IF(A21=0,\" \", A21)","v":"Typ:…"},{"$f":"IF(B21=0,\" \", B21)","v":"Typ:…"},{"$f":"IF(C21=0,\" \", C21)","v":"Typ:…"},null,{"$f":"Bestellformular!E33","v":"Typ:…"},{"$f":"IF(F21=0,\" \", F21)","v":"Typ:…"},{"$f":"IF(G21=0,\" \", G21)","v":"Typ:…"},{"$f":"IF(H21=0,\" \", H21)","v":"Typ:…"},{"$f":"Bestellformular!E34","v":"Typ:…"},{"$f":"IF(J21=0,\" \", J21)","v":"Typ:…"},{"$f":"IF(K21=0,\" \", K21)","v":"Typ:…"},{"$f":"IF(L21=0,\" \", L21)","v":"Typ:…"},null,{"$f":"Bestellformular!E35","v":"Typ:…"},{"$f":"IF(O21=0,\" \", O21)","v":"Typ:…"},{"$f":"IF(P21=0,\" \", P21)","v":"Typ:…"},{"$f":"IF(Q21=0,\" \", Q21)","v":"Typ:…"},{"$f":"Bestellformular!E36","v":"Typ:…"},{"$f":"IF(S21=0,\" \", S21)","v":"Typ:…"},{"$f":"IF(T21=0,\" \", T21)","v":"Typ:…"},{"$f":"IF(U21=0,\" \", U21)","v":"Typ:…"},null,{"$f":"Bestellformular!E37","v":"Typ:…"},{"$f":"IF(X21=0,\" \", X21)","v":"Typ:…"},{"$f":"IF(Y21=0,\" \", Y21)","v":"Typ:…"},{"$f":"IF(Z21=0,\" \", Z21)","v":"Typ:…"},{"$f":"Bestellformular!E38","v":"Typ:…"},{"$f":"IF(AB21=0,\" \", AB21)","v":"Typ:…"},{"$f":"IF(AC21=0,\" \", AC21)","v":"Typ:…"},{"$f":"IF(AD21=0,\" \", AD21)","v":"Typ:…"},null,{"$f":"Bestellformular!E39","v":"Typ:…"},{"$f":"IF(AG21=0,\" \", AG21)","v":"Typ:…"},{"$f":"IF(AH21=0,\" \", AH21)","v":"Typ:…"},{"$f":"IF(AI21=0,\" \", AI21)","v":"Typ:…"},{"$f":"Bestellformular!E40","v":"Typ:…"},{"$f":"IF(AK21=0,\" \", AK21)","v":"Typ:…"},{"$f":"IF(AL21=0,\" \", AL21)","v":"Typ:…"},{"$f":"IF(AM21=0,\" \", AM21)","v":"Typ:…"},null,{"$f":"Bestellformular!E41","v":"Typ:…"},{"$f":"IF(AP21=0,\" \", AP21)","v":"Typ:…"},{"$f":"IF(AQ21=0,\" \", AQ21)","v":"Typ:…"},{"$f":"IF(AR21=0,\" \", AR21)","v":"Typ:…"}]
[{"$f":"IF(A$21=$B$1,$B2,IF(A$21=$D$1,$D2,IF(A$21=$F$1,$F2,IF(A$21=$H$1,$H2,IF(A$21=$J$1,$J2,IF(A$21=$L$1,$L2,IF(A$21=$N$1,$N2,IF(A$21=$P$1,$P2,IF(A$21=$R$1,$R2,IF(A$21=$T$1,$T2,IF(A$21=$V$1,V2,)))))))))))","v":0},{"$f":"IF(A22=0,\" \", A22)","v":" "},{"$f":"IF(C$21=$B$1,$C2,IF(C$21=$D$1,$E2,IF(C$21=$F$1,$G2,IF(C$21=$H$1,$I2,IF(C$21=$J$1,$K2,IF(C$21=$L$1,$M2,IF(C$21=$N$1,$O2,IF(C$21=$P$1,$Q2,IF(C$21=$R$1,$S2,IF(C$21=$T$1,$U2,IF(A$21=V$1,W2,)))))))))))","v":0},{"$f":"IF(C22=0,\" \", C22)","v":" "},null,{"$f":"IF(F$21=$B$1,$B2,IF(F$21=$D$1,$D2,IF(F$21=$F$1,$F2,IF(F$21=$H$1,$H2,IF(F$21=$J$1,$J2,IF(F$21=$L$1,$L2,IF(F$21=$N$1,$N2,IF(F$21=$P$1,$P2,IF(F$21=$R$1,$R2,IF(F$21=$T$1,$T2,))))))))))","v":0},{"$f":"IF(F22=0,\" \", F22)","v":" "},{"$f":"IF(H$21=$B$1,$C2,IF(H$21=$D$1,$E2,IF(H$21=$F$1,$G2,IF(H$21=$H$1,$I2,IF(H$21=$J$1,$K2,IF(H$21=$L$1,$M2,IF(H$21=$N$1,$O2,IF(H$21=$P$1,$Q2,IF(H$21=$R$1,$S2,IF(H$21=$T$1,$U2,\" \"))))))))))","v":" "},{"$f":"IF(H22=0,\" \", H22)","v":" "},{"$f":"IF(J$21=$B$1,$B2,IF(J$21=$D$1,$D2,IF(J$21=$F$1,$F2,IF(J$21=$H$1,$H2,IF(J$21=$J$1,$J2,IF(J$21=$L$1,$L2,IF(J$21=$N$1,$N2,IF(J$21=$P$1,$P2,IF(J$21=$R$1,$R2,IF(J$21=$T$1,$T2,))))))))))","v":0},{"$f":"IF(J22=0,\" \", J22)","v":" "},{"$f":"IF(L$21=$B$1,$C2,IF(L$21=$D$1,$E2,IF(L$21=$F$1,$G2,IF(L$21=$H$1,$I2,IF(L$21=$J$1,$K2,IF(L$21=$L$1,$M2,IF(L$21=$N$1,$O2,IF(L$21=$P$1,$Q2,IF(L$21=$R$1,$S2,IF(L$21=$T$1,$U2,\" \"))))))))))","v":" "},{"$f":"IF(L22=0,\" \", L22)","v":" "},null,{"$f":"IF(O$21=$B$1,$B2,IF(O$21=$D$1,$D2,IF(O$21=$F$1,$F2,IF(O$21=$H$1,$H2,IF(O$21=$J$1,$J2,IF(O$21=$L$1,$L2,IF(O$21=$N$1,$N2,IF(O$21=$P$1,$P2,IF(O$21=$R$1,$R2,IF(O$21=$T$1,$T2,))))))))))","v":0},{"$f":"IF(O22=0,\" \", O22)","v":" "},{"$f":"IF(Q$21=$B$1,$C2,IF(Q$21=$D$1,$E2,IF(Q$21=$F$1,$G2,IF(Q$21=$H$1,$I2,IF(Q$21=$J$1,$K2,IF(Q$21=$L$1,$M2,IF(Q$21=$N$1,$O2,IF(Q$21=$P$1,$Q2,IF(Q$21=$R$1,$S2,IF(Q$21=$T$1,$U2,\" \"))))))))))","v":" "},{"$f":"IF(Q22=0,\" \", Q22)","v":" "},{"$f":"IF(S$21=$B$1,$B2,IF(S$21=$D$1,$D2,IF(S$21=$F$1,$F2,IF(S$21=$H$1,$H2,IF(S$21=$J$1,$J2,IF(S$21=$L$1,$L2,IF(S$21=$N$1,$N2,IF(S$21=$P$1,$P2,IF(S$21=$R$1,$R2,IF(S$21=$T$1,$T2,))))))))))","v":0},{"$f":"IF(S22=0,\" \", S22)","v":" "},{"$f":"IF(U$21=$B$1,$C2,IF(U$21=$D$1,$E2,IF(U$21=$F$1,$G2,IF(U$21=$H$1,$I2,IF(U$21=$J$1,$K2,IF(U$21=$L$1,$M2,IF(U$21=$N$1,$O2,IF(U$21=$P$1,$Q2,IF(U$21=$R$1,$S2,IF(U$21=$T$1,$U2,\" \"))))))))))","v":" "},{"$f":"IF(U22=0,\" \", U22)","v":" "},null,{"$f":"IF(X$21=$B$1,$B2,IF(X$21=$D$1,$D2,IF(X$21=$F$1,$F2,IF(X$21=$H$1,$H2,IF(X$21=$J$1,$J2,IF(X$21=$L$1,$L2,IF(X$21=$N$1,$N2,IF(X$21=$P$1,$P2,IF(X$21=$R$1,$R2,IF(X$21=$T$1,$T2,))))))))))","v":0},{"$f":"IF(X22=0,\" \", X22)","v":" "},{"$f":"IF(Z$21=$B$1,$C2,IF(Z$21=$D$1,$E2,IF(Z$21=$F$1,$G2,IF(Z$21=$H$1,$I2,IF(Z$21=$J$1,$K2,IF(Z$21=$L$1,$M2,IF(Z$21=$N$1,$O2,IF(Z$21=$P$1,$Q2,IF(Z$21=$R$1,$S2,IF(Z$21=$T$1,$U2,\" \"))))))))))","v":" "},{"$f":"IF(Z22=0,\" \", Z22)","v":" "},{"$f":"IF(AB$21=$B$1,$B2,IF(AB$21=$D$1,$D2,IF(AB$21=$F$1,$F2,IF(AB$21=$H$1,$H2,IF(AB$21=$J$1,$J2,IF(AB$21=$L$1,$L2,IF(AB$21=$N$1,$N2,IF(AB$21=$P$1,$P2,IF(AB$21=$R$1,$R2,IF(AB$21=$T$1,$T2,))))))))))","v":0},{"$f":"IF(AB22=0,\" \", AB22)","v":" "},{"$f":"IF(AD$21=$B$1,$C2,IF(AD$21=$D$1,$E2,IF(AD$21=$F$1,$G2,IF(AD$21=$H$1,$I2,IF(AD$21=$J$1,$K2,IF(AD$21=$L$1,$M2,IF(AD$21=$N$1,$O2,IF(AD$21=$P$1,$Q2,IF(AD$21=$R$1,$S2,IF(AD$21=$T$1,$U2,\" \"))))))))))","v":" "},{"$f":"IF(AD22=0,\" \", AD22)","v":" "},null,{"$f":"IF(AG$21=$B$1,$B2,IF(AG$21=$D$1,$D2,IF(AG$21=$F$1,$F2,IF(AG$21=$H$1,$H2,IF(AG$21=$J$1,$J2,IF(AG$21=$L$1,$L2,IF(AG$21=$N$1,$N2,IF(AG$21=$P$1,$P2,IF(AG$21=$R$1,$R2,IF(AG$21=$T$1,$T2,))))))))))","v":0},{"$f":"IF(AG22=0,\" \", AG22)","v":" "},{"$f":"IF(AI$21=$B$1,$C2,IF(AI$21=$D$1,$E2,IF(AI$21=$F$1,$G2,IF(AI$21=$H$1,$I2,IF(AI$21=$J$1,$K2,IF(AI$21=$L$1,$M2,IF(AI$21=$N$1,$O2,IF(AI$21=$P$1,$Q2,IF(AI$21=$R$1,$S2,IF(AI$21=$T$1,$U2,\" \"))))))))))","v":" "},{"$f":"IF(AI22=0,\" \", AI22)","v":" "},{"$f":"IF(AK$21=$B$1,$B2,IF(AK$21=$D$1,$D2,IF(AK$21=$F$1,$F2,IF(AK$21=$H$1,$H2,IF(AK$21=$J$1,$J2,IF(AK$21=$L$1,$L2,IF(AK$21=$N$1,$N2,IF(AK$21=$P$1,$P2,IF(AK$21=$R$1,$R2,IF(AK$21=$T$1,$T2,))))))))))","v":0},{"$f":"IF(AK22=0,\" \", AK22)","v":" "},{"$f":"IF(AM$21=$B$1,$C2,IF(AM$21=$D$1,$E2,IF(AM$21=$F$1,$G2,IF(AM$21=$H$1,$I2,IF(AM$21=$J$1,$K2,IF(AM$21=$L$1,$M2,IF(AM$21=$N$1,$O2,IF(AM$21=$P$1,$Q2,IF(AM$21=$R$1,$S2,IF(AM$21=$T$1,$U2,\" \"))))))))))","v":" "},{"$f":"IF(AM22=0,\" \", AM22)","v":" "},null,{"$f":"IF(AP$21=$B$1,$B2,IF(AP$21=$D$1,$D2,IF(AP$21=$F$1,$F2,IF(AP$21=$H$1,$H2,IF(AP$21=$J$1,$J2,IF(AP$21=$L$1,$L2,IF(AP$21=$N$1,$N2,IF(AP$21=$P$1,$P2,IF(AP$21=$R$1,$R2,IF(AP$21=$T$1,$T2,))))))))))","v":0},{"$f":"IF(AP22=0,\" \", AP22)","v":" "},{"$f":"IF(AR$21=$B$1,$C2,IF(AR$21=$D$1,$E2,IF(AR$21=$F$1,$G2,IF(AR$21=$H$1,$I2,IF(AR$21=$J$1,$K2,IF(AR$21=$L$1,$M2,IF(AR$21=$N$1,$O2,IF(AR$21=$P$1,$Q2,IF(AR$21=$R$1,$S2,IF(AR$21=$T$1,$U2,\" \"))))))))))","v":" "},{"$f":"IF(AR22=0,\" \", AR22)","v":" "}]
[{"$f":"IF(A$21=$B$1,$B3,IF(A$21=$D$1,$D3,IF(A$21=$F$1,$F3,IF(A$21=$H$1,$H3,IF(A$21=$J$1,$J3,IF(A$21=$L$1,$L3,IF(A$21=$N$1,$N3,IF(A$21=$P$1,$P3,IF(A$21=$R$1,$R3,IF(A$21=$T$1,$T3,IF(A$21=$V$1,V3,)))))))))))","v":0},{"$f":"IF(A23=0,\" \", A23)","v":" "},{"$f":"IF(C$21=$B$1,$C3,IF(C$21=$D$1,$E3,IF(C$21=$F$1,$G3,IF(C$21=$H$1,$I3,IF(C$21=$J$1,$K3,IF(C$21=$L$1,$M3,IF(C$21=$N$1,$O3,IF(C$21=$P$1,$Q3,IF(C$21=$R$1,$S3,IF(C$21=$T$1,$U3,IF(A$21=V$1,W3,)))))))))))","v":0},{"$f":"IF(C23=0,\" \", C23)","v":" "},null,{"$f":"IF(F$21=$B$1,$B3,IF(F$21=$D$1,$D3,IF(F$21=$F$1,$F3,IF(F$21=$H$1,$H3,IF(F$21=$J$1,$J3,IF(F$21=$L$1,$L3,IF(F$21=$N$1,$N3,IF(F$21=$P$1,$P3,IF(F$21=$R$1,$R3,IF(F$21=$T$1,$T3,))))))))))","v":0},{"$f":"IF(F23=0,\" \", F23)","v":" "},{"$f":"IF(H$21=$B$1,$C3,IF(H$21=$D$1,$E3,IF(H$21=$F$1,$G3,IF(H$21=$H$1,$I3,IF(H$21=$J$1,$K3,IF(H$21=$L$1,$M3,IF(H$21=$N$1,$O3,IF(H$21=$P$1,$Q3,IF(H$21=$R$1,$S3,IF(H$21=$T$1,$U3,\" \"))))))))))","v":" "},{"$f":"IF(H23=0,\" \", H23)","v":" "},{"$f":"IF(J$21=$B$1,$B3,IF(J$21=$D$1,$D3,IF(J$21=$F$1,$F3,IF(J$21=$H$1,$H3,IF(J$21=$J$1,$J3,IF(J$21=$L$1,$L3,IF(J$21=$N$1,$N3,IF(J$21=$P$1,$P3,IF(J$21=$R$1,$R3,IF(J$21=$T$1,$T3,))))))))))","v":0},{"$f":"IF(J23=0,\" \", J23)","v":" "},{"$f":"IF(L$21=$B$1,$C3,IF(L$21=$D$1,$E3,IF(L$21=$F$1,$G3,IF(L$21=$H$1,$I3,IF(L$21=$J$1,$K3,IF(L$21=$L$1,$M3,IF(L$21=$N$1,$O3,IF(L$21=$P$1,$Q3,IF(L$21=$R$1,$S3,IF(L$21=$T$1,$U3,\" \"))))))))))","v":" "},{"$f":"IF(L23=0,\" \", L23)","v":" "},null,{"$f":"IF(O$21=$B$1,$B3,IF(O$21=$D$1,$D3,IF(O$21=$F$1,$F3,IF(O$21=$H$1,$H3,IF(O$21=$J$1,$J3,IF(O$21=$L$1,$L3,IF(O$21=$N$1,$N3,IF(O$21=$P$1,$P3,IF(O$21=$R$1,$R3,IF(O$21=$T$1,$T3,))))))))))","v":0},{"$f":"IF(O23=0,\" \", O23)","v":" "},{"$f":"IF(Q$21=$B$1,$C3,IF(Q$21=$D$1,$E3,IF(Q$21=$F$1,$G3,IF(Q$21=$H$1,$I3,IF(Q$21=$J$1,$K3,IF(Q$21=$L$1,$M3,IF(Q$21=$N$1,$O3,IF(Q$21=$P$1,$Q3,IF(Q$21=$R$1,$S3,IF(Q$21=$T$1,$U3,\" \"))))))))))","v":" "},{"$f":"IF(Q23=0,\" \", Q23)","v":" "},{"$f":"IF(S$21=$B$1,$B3,IF(S$21=$D$1,$D3,IF(S$21=$F$1,$F3,IF(S$21=$H$1,$H3,IF(S$21=$J$1,$J3,IF(S$21=$L$1,$L3,IF(S$21=$N$1,$N3,IF(S$21=$P$1,$P3,IF(S$21=$R$1,$R3,IF(S$21=$T$1,$T3,))))))))))","v":0},{"$f":"IF(S23=0,\" \", S23)","v":" "},{"$f":"IF(U$21=$B$1,$C3,IF(U$21=$D$1,$E3,IF(U$21=$F$1,$G3,IF(U$21=$H$1,$I3,IF(U$21=$J$1,$K3,IF(U$21=$L$1,$M3,IF(U$21=$N$1,$O3,IF(U$21=$P$1,$Q3,IF(U$21=$R$1,$S3,IF(U$21=$T$1,$U3,\" \"))))))))))","v":" "},{"$f":"IF(U23=0,\" \", U23)","v":" "},null,{"$f":"IF(X$21=$B$1,$B3,IF(X$21=$D$1,$D3,IF(X$21=$F$1,$F3,IF(X$21=$H$1,$H3,IF(X$21=$J$1,$J3,IF(X$21=$L$1,$L3,IF(X$21=$N$1,$N3,IF(X$21=$P$1,$P3,IF(X$21=$R$1,$R3,IF(X$21=$T$1,$T3,))))))))))","v":0},{"$f":"IF(X23=0,\" \", X23)","v":" "},{"$f":"IF(Z$21=$B$1,$C3,IF(Z$21=$D$1,$E3,IF(Z$21=$F$1,$G3,IF(Z$21=$H$1,$I3,IF(Z$21=$J$1,$K3,IF(Z$21=$L$1,$M3,IF(Z$21=$N$1,$O3,IF(Z$21=$P$1,$Q3,IF(Z$21=$R$1,$S3,IF(Z$21=$T$1,$U3,\" \"))))))))))","v":" "},{"$f":"IF(Z23=0,\" \", Z23)","v":" "},{"$f":"IF(AB$21=$B$1,$B3,IF(AB$21=$D$1,$D3,IF(AB$21=$F$1,$F3,IF(AB$21=$H$1,$H3,IF(AB$21=$J$1,$J3,IF(AB$21=$L$1,$L3,IF(AB$21=$N$1,$N3,IF(AB$21=$P$1,$P3,IF(AB$21=$R$1,$R3,IF(AB$21=$T$1,$T3,))))))))))","v":0},{"$f":"IF(AB23=0,\" \", AB23)","v":" "},{"$f":"IF(AD$21=$B$1,$C3,IF(AD$21=$D$1,$E3,IF(AD$21=$F$1,$G3,IF(AD$21=$H$1,$I3,IF(AD$21=$J$1,$K3,IF(AD$21=$L$1,$M3,IF(AD$21=$N$1,$O3,IF(AD$21=$P$1,$Q3,IF(AD$21=$R$1,$S3,IF(AD$21=$T$1,$U3,\" \"))))))))))","v":" "},{"$f":"IF(AD23=0,\" \", AD23)","v":" "},null,{"$f":"IF(AG$21=$B$1,$B3,IF(AG$21=$D$1,$D3,IF(AG$21=$F$1,$F3,IF(AG$21=$H$1,$H3,IF(AG$21=$J$1,$J3,IF(AG$21=$L$1,$L3,IF(AG$21=$N$1,$N3,IF(AG$21=$P$1,$P3,IF(AG$21=$R$1,$R3,IF(AG$21=$T$1,$T3,))))))))))","v":0},{"$f":"IF(AG23=0,\" \", AG23)","v":" "},{"$f":"IF(AI$21=$B$1,$C3,IF(AI$21=$D$1,$E3,IF(AI$21=$F$1,$G3,IF(AI$21=$H$1,$I3,IF(AI$21=$J$1,$K3,IF(AI$21=$L$1,$M3,IF(AI$21=$N$1,$O3,IF(AI$21=$P$1,$Q3,IF(AI$21=$R$1,$S3,IF(AI$21=$T$1,$U3,\" \"))))))))))","v":" "},{"$f":"IF(AI23=0,\" \", AI23)","v":" "},{"$f":"IF(AK$21=$B$1,$B3,IF(AK$21=$D$1,$D3,IF(AK$21=$F$1,$F3,IF(AK$21=$H$1,$H3,IF(AK$21=$J$1,$J3,IF(AK$21=$L$1,$L3,IF(AK$21=$N$1,$N3,IF(AK$21=$P$1,$P3,IF(AK$21=$R$1,$R3,IF(AK$21=$T$1,$T3,))))))))))","v":0},{"$f":"IF(AK23=0,\" \", AK23)","v":" "},{"$f":"IF(AM$21=$B$1,$C3,IF(AM$21=$D$1,$E3,IF(AM$21=$F$1,$G3,IF(AM$21=$H$1,$I3,IF(AM$21=$J$1,$K3,IF(AM$21=$L$1,$M3,IF(AM$21=$N$1,$O3,IF(AM$21=$P$1,$Q3,IF(AM$21=$R$1,$S3,IF(AM$21=$T$1,$U3,\" \"))))))))))","v":" "},{"$f":"IF(AM23=0,\" \", AM23)","v":" "},null,{"$f":"IF(AP$21=$B$1,$B3,IF(AP$21=$D$1,$D3,IF(AP$21=$F$1,$F3,IF(AP$21=$H$1,$H3,IF(AP$21=$J$1,$J3,IF(AP$21=$L$1,$L3,IF(AP$21=$N$1,$N3,IF(AP$21=$P$1,$P3,IF(AP$21=$R$1,$R3,IF(AP$21=$T$1,$T3,))))))))))","v":0},{"$f":"IF(AP23=0,\" \", AP23)","v":" "},{"$f":"IF(AR$21=$B$1,$C3,IF(AR$21=$D$1,$E3,IF(AR$21=$F$1,$G3,IF(AR$21=$H$1,$I3,IF(AR$21=$J$1,$K3,IF(AR$21=$L$1,$M3,IF(AR$21=$N$1,$O3,IF(AR$21=$P$1,$Q3,IF(AR$21=$R$1,$S3,IF(AR$21=$T$1,$U3,\" \"))))))))))","v":" "},{"$f":"IF(AR23=0,\" \", AR23)","v":" "}]
[0," ",0," ",null,0," "," "," ",0," "," "," ",null,0," "," "," ",0," "," "," ",null,0," "," "," ",0," "," "," ",null,0," "," "," ",0," "," "," ",null,0," "," "," "]
[0," ",0," ",null,0," "," "," ",0," "," "," ",null,0," "," "," ",0," "," "," ",null,0," "," "," ",0," "," "," ",null,0," "," "," ",0," "," "," ",null,0," "," "," "]
[0," ",0," ",null,0," "," "," ",0," "," "," ",null,0," "," "," ",0," "," "," ",null,0," "," "," ",0," "," "," ",null,0," "," "," ",0," "," "," ",null,0," "," "," "]
[0," ",0," ",null,0," "," "," ",0," "," "," ",null,0," "," "," ",0," "," "," ",null,0," "," "," ",0," "," "," ",null,0," "," "," ",0," "," "," ",null,0," "," "," "]
[0," ",0," ",null,0," "," "," ",0," "," "," ",null,0," "," "," ",0," "," "," ",null,0," "," "," ",0," "," "," ",null,0," "," "," ",0," "," "," ",null,0," "," "," "]
[0," ",0," ",null,0," "," "," ",0," "," "," ",null,0," "," "," ",0," "," "," ",null,0," "," "," ",0," "," "," ",null,0," "," "," ",0," "," "," ",null,0," "," "," "]
[0," ",0," ",null,0," "," "," ",0," "," "," ",null,0," "," "," ",0," "," "," ",null,0," "," "," ",0," "," "," ",null,0," "," "," ",0," "," "," ",null,0," "," "," "]
[0," ",0," ",null,0," "," "," ",0," "," "," ",null,0," "," "," ",0," "," "," ",null,0," "," "," ",0," "," "," ",null,0," "," "," ",0," "," "," ",null,0," "," "," "]
[0," ",0," ",null,0," "," "," ",0," "," "," ",null,0," "," "," ",0," "," "," ",null,0," "," "," ",0," "," "," ",null,0," "," "," ",0," "," "," ",null,0," "," "," "]
[0," ",0," ",null,0," "," "," ",0," "," "," ",null,0," "," "," ",0," "," "," ",null,0," "," "," ",0," "," "," ",null,0," "," "," ",0," "," "," ",null,0," "," "," "]
[0," ",0," ",null,0," "," "," ",0," "," "," ",null,0," "," "," ",0," "," "," ",null,0," "," "," ",0," "," "," ",null,0," "," "," ",0," "," "," ",null,0," "," "," "]
[0," ",0," ",null,0," "," "," ",0," "," "," ",null,0," "," "," ",0," "," "," ",null,0," "," "," ",0," "," "," ",null,0," "," "," ",0," "," "," ",null,0," "," "," "]
[0," ",0," ",null,0," "," "," ",0," "," "," ",null,0," "," "," ",0," "," "," ",null,0," "," "," ",0," "," "," ",null,0," "," "," ",0," "," "," ",null,0," "," "," "]
[0," ",0," ",null,0," "," "," ",0," "," "," ",null,0," "," "," ",0," "," "," ",null,0," "," "," ",0," "," "," ",null,0," "," "," ",0," "," "," ",null,0," "," "," "]
[0," ",0," ",null,0," "," "," ",0," "," "," ",null,0," "," "," ",0," "," "," ",null,0," "," "," ",0," "," "," ",null,0," "," "," ",0," "," "," ",null,0," "," "," "]
[0," ",0," ",null,0," "," "," ",0," "," "," ",null,0," "," "," ",0," "," "," ",null,0," "," "," ",0," "," "," ",null,0," "," "," ",0," "," "," ",null,0," "," "," "]
[0," ",0," ",null,0," "," "," ",0," "," "," ",null,0," "," "," ",0," "," "," ",null,0," "," "," ",0," "," "," ",null,0," "," "," ",0," "," "," ",null,0," "," "," "]